{"text_format":"1","workbook":"xlsx","n_sheets":10,"sheets":["Instructions","Post-visit Report - Part 1","Part 1a - Nationalities cont.","Post-visit Report - Part 2","Part 2a - Site visits cont.","Part 2b - Site visits cont.","Part 3 - South Georgia","Site Reference Data","myvariables","Variables"],"not_rendered":{"charts":0,"images":0,"macros":1,"external_links":1,"defined_names":23,"comments":0,"pivot_tables":0},"unopened":[],"bounds":{"document_bytes":16777216,"sheet_cells":100000,"rows_first":2000,"rows_last":500,"rows_between":2000,"halvings":0,"cell_chars":16384,"cell_head_chars":4096},"cells_cut":0,"cells_raw":0,"read":"whole","date_system":"1900"}

{"sheet":"Instructions","index":0,"n_rows":89,"n_cols":16,"rows_kept":89,"cut":false,"hidden":false,"merged":[[19,1,27,18],[87,2,87,10],[87,14,87,17],[88,2,94,17],[89,19,89,21],[30,2,30,10],[30,14,30,17],[31,2,44,17],[48,2,84,17],[32,19,32,21],[35,0,35,1],[47,2,47,10],[47,15,47,17],[1,1,1,14],[3,1,3,14],[5,1,5,14],[6,1,16,18],[18,1,18,14]]}
[]
[null,"POST-VISIT REPORT FORM"]
[]
[null,"PVR 2019-20 Rev.2 (January 21, 2020) provided by NSF and IAATO         "]
[]
[null,"About this Form"]
[null,"\nThe form consists of two parts, both of which are to be completed by an authorized person (e.g. expedition leader or captain) and submitted to an appropriate national authority and to IAATO.\n\nTo submit the PVR to IAATO, please use one of the following methods for inclusion in the comprehensive tourism database:\n\n1)  Enter voyage information directly in the IAATO PVR online form.\n   • For instructions, please see the 'Instructions' tab on the 'Add PVR' form page.\n   • Use this link to access the online PVR form: http://apps.iaato.org/iaato/pvr\n\n2) Or upload the Excel PVR file using the IAATO PVR upload tool.\n\nThe Expedition record (Part 1) must be completed for every expedition regardless of whether any landings or visits to sites were made.  \n\nThe Site Visit record (Part 2) should only be completed if visits or landings were made. For cruise only vessels, you may include waterways.\n\nOTHER THAN DATA ENTRY, PLEASE DO NOT MODIFY THIS DOCUMENT IN ANY WAY AS THE FORM WILL NOT IMPORT CORRECTLY.\n\nPLEASE USE A BLANK, UNUSED PVR FORM FOR EACH VOYAGE. DO NOT CUT AND PASTE FROM PREVIOUSLY FILED PVR."]
[]
[]
[]
[]
[]
[]
[]
[]
{"$rows_left_out":75}
{"sheet":"Post-visit Report - Part 1","index":1,"n_rows":80,"n_cols":15,"rows_kept":80,"cut":false,"hidden":false,"merged":[[7,14,8,15],[7,7,7,8],[8,7,8,8],[9,7,9,12],[9,1,9,6],[12,9,12,12],[11,1,11,3],[11,4,11,5],[13,9,13,12],[33,1,33,3],[32,1,32,3],[38,1,38,3],[37,1,37,3],[36,1,36,3],[34,1,34,3],[35,1,35,3],[12,4,12,6],[22,6,22,8],[12,7,12,8],[29,1,29,3],[20,6,20,8],[28,1,28,3],[15,1,15,12],[23,9,23,12],[21,6,21,8],[23,6,23,8],[13,4,13,6],[20,1,20,5],[21,1,21,5],[22,1,22,5],[23,1,23,5],[1,1,1,8],[1,9,1,12],[30,1,30,3],[31,1,31,3],[21,9,21,12],[5,1,5,3],[7,9,7,12],[8,9,8,12],[11,7,11,8],[7,1,7,6],[8,1,8,6],[26,1,26,3],[17,1,17,12],[16,1,16,12],[10,7,10,12],[13,7,13,8],[10,1,10,6],[27,1,27,3],[11,9,11,12],[22,9,22,12],[20,9,20,12],[12,1,12,3],[13,1,13,3],[14,1,14,12],[44,1,44,3],[39,1,39,3],[43,1,43,3],[42,1,42,3],[41,1,41,3],[40,1,40,3],[56,12,57,12],[69,1,69,12],[57,1,57,3],[56,1,56,3],[65,1,65,12],[68,1,68,12],[64,11,64,12],[67,11,67,12],[56,11,57,11],[56,8,57,8],[56,9,57,9],[56,10,57,10],[66,1,66,12],[49,1,49,3],[53,1,53,3],[54,1,54,3],[45,1,45,3],[46,1,46,3],[78,9,78,12],[78,3,78,7],[78,1,78,2],[72,1,72,12],[73,1,73,12],[74,1,74,9],[74,11,74,12],[75,1,75,12],[76,1,76,12],[47,1,47,3],[50,1,50,3],[51,1,51,3],[52,1,52,3],[48,1,48,3],[70,1,70,12],[71,1,71,12],[58,2,58,10],[59,2,59,10],[60,2,60,10],[61,2,61,10],[67,1,67,9],[64,1,64,9],[55,1,55,3]]}
[]
[null,"POST-VISIT REPORT FORM: PART 1 - Expedition Record",null,null,null,null,null,null,null,"View Instructions for this Page",null,null,null,null,"2019-2020"]
[null,"The Expedition Record is completed for every Expedition."]
[null,"Please submit both Part 1 and Part 2 to an appropriate national authority within three months of"]
[null,"the activity having taken place."]
[]
[null,"A:","Expedition Details"]
[null,"Company name:",null,null,null,null,null,"Voyage/Flight number:",null,null,null,null,null,null,"Voyage Number Example"]
[null,null,null,null,null,null,null,"Voyage Name:"]
[null,"Expedition Leaders(s) name:",null,null,null,null,null,"Vessel/Aircraft name:"]
[]
[null,"Expedition is:",null,null,null,null,"based","Captain's/Commander's name:"]
[null,"Port of Embarkation:",null,null,null,null,null,"Port of Disembarkation:"]
[null,"Date of Embarkation:",null,null,null,null,null,"Date of Disembarkation:"]
[null,"Actual itinerary traveled: please provide description of route, giving dates:"]
{"$rows_left_out":66}
{"sheet":"Part 1a - Nationalities cont.","index":2,"n_rows":43,"n_cols":15,"rows_kept":43,"cut":false,"hidden":false,"merged":[[7,1,7,3],[8,1,8,3],[9,1,9,3],[2,9,2,12],[1,1,1,10],[21,1,21,3],[10,1,10,3],[11,1,11,3],[12,1,12,3],[13,1,13,3],[14,1,14,3],[15,1,15,3],[16,1,16,3],[17,1,17,3],[18,1,18,3],[19,1,19,3],[20,1,20,3],[33,1,33,3],[22,1,22,3],[23,1,23,3],[24,1,24,3],[25,1,25,3],[26,1,26,3],[27,1,27,3],[28,1,28,3],[29,1,29,3],[30,1,30,3],[31,1,31,3],[32,1,32,3],[39,2,39,10],[40,2,40,10],[41,2,41,10],[42,2,42,10],[34,1,34,3],[35,1,35,3],[36,1,36,3],[37,1,37,3],[37,8,38,8],[37,11,38,11],[37,9,38,9],[37,10,38,10],[37,12,38,12],[38,1,38,3]]}
[]
[null,"POST-VISIT REPORT FORM: PART 1a - Expedition Record (Addendum)",null,null,null,null,null,null,null,null,null,null,null,null,"2019-2020"]
[null,null,null,null,null,null,null,null,null,"View Instructions for this Page"]
[]
[]
[]
[null,"C:","Record of Expedition numbers by nationality"]
[null,"Nationality",null,null,"Pax","Staff","Crew","Other","Nationality","Pax","Staff","Crew","Other"]
[]
[]
[]
[]
[]
[]
[]
{"$rows_left_out":29}
{"sheet":"Post-visit Report - Part 2","index":3,"n_rows":42,"n_cols":16,"rows_kept":42,"cut":false,"hidden":false,"merged":[[41,1,41,5],[5,2,5,3],[5,6,5,10],[3,2,3,3],[3,5,3,6],[40,1,40,5],[5,11,5,14],[22,11,22,12],[28,11,28,12],[38,1,38,5],[39,1,39,5],[8,11,8,12],[9,11,9,12],[13,11,13,12],[14,11,14,12],[15,11,15,12],[29,11,29,12],[30,11,30,12],[23,11,23,12],[24,11,24,12],[35,11,35,12],[33,11,33,12],[1,0,1,3],[0,4,0,5],[3,0,3,1],[0,7,0,9],[0,0,0,3],[3,9,3,12],[3,7,3,8],[0,12,0,14],[1,12,1,14],[3,13,3,14],[0,10,0,11],[1,10,1,11],[26,11,26,12],[31,11,31,12],[38,12,38,14],[32,11,32,12],[27,11,27,12],[39,12,41,14],[36,11,36,12],[6,2,6,3],[10,11,10,12],[6,11,7,14],[20,11,20,12],[21,11,21,12],[12,11,12,12],[16,11,16,12],[6,6,6,10],[11,11,11,12],[17,11,17,12],[18,11,18,12],[19,11,19,12],[34,11,34,12],[25,11,25,12]]}
["POST-VISIT REPORT FORM: PART 2 - Site Visit Record",null,null,null,"View Instructions for this Page",null,null,"Voyage Number:",null,null,{"$f":"T('Post-visit Report - Part 1'!J8)","v":""}]
["Complete one line of the Site Visit Record wherever Expedition members disembark or journey beyond base or camp.              ",null,null,null,null,null,null,"Embarkation Date:",null,null,{"$f":"IF('Post-visit Report - Part 1'!E14 = 0, \"\", 'Post-visit Report - Part 1'!E14)","v":""}]
[]
["Tour Company or Name:",null,{"$f":"CONCATENATE(T('Post-visit Report - Part 1'!D8), \" \", T('Post-visit Report - Part 1'!B9))","v":" "},null,"Vessel Name:",{"$f":"CONCATENATE(T('Post-visit Report - Part 1'!J10), \" \", T('Post-visit Report - Part 1'!H11))","v":" "},null,"Voyage Name:",null,{"$f":"T('Post-visit Report - Part 1'!J9)","v":""}]
[]
["Date","Site visited","Site Latitude/Longitude",null,"1st pax arrive","Last pax depart","Number of people",null,null,null,null,"Activities at Site"]
[null,null,null,null,"shore/site","shore/site","making site visit",null,null,null,null,"Select up to three activities per Site Visit entry. \nUse additional lines if the number of passengers differs per activity or more than three activities occurred."]
[null,null,"Latitude","Longitude","(in GMT)","(in GMT)","Pax","Staff","Crew","Other","Total",null,null,null,null,"Activity Example"]
[null,null,null,null,null,null,null,null,null,null,{"$f":"SUM(G9:J9)","v":0}]
[null,null,null,null,null,null,null,null,null,null,0]
[null,null,null,null,null,null,null,null,null,null,0]
[null,null,null,null,null,null,null,null,null,null,{"$f":"SUM(G12:J12)","v":0}]
[null,null,null,null,null,null,null,null,null,null,{"$f":"SUM(G13:J13)","v":0}]
[null,null,null,null,null,null,null,null,null,null,{"$f":"SUM(G14:J14)","v":0}]
[null,null,null,null,null,null,null,null,null,null,0,null,null,"  "]
{"$rows_left_out":28}
{"sheet":"Part 2a - Site visits cont.","index":4,"n_rows":42,"n_cols":16,"rows_kept":42,"cut":false,"hidden":false,"merged":[[35,11,35,12],[36,11,36,12],[38,1,38,5],[38,12,38,14],[39,1,39,5],[39,12,41,14],[40,1,40,5],[41,1,41,5],[34,11,34,12],[23,11,23,12],[24,11,24,12],[25,11,25,12],[26,11,26,12],[27,11,27,12],[28,11,28,12],[29,11,29,12],[30,11,30,12],[31,11,31,12],[32,11,32,12],[33,11,33,12],[22,11,22,12],[11,11,11,12],[12,11,12,12],[13,11,13,12],[14,11,14,12],[15,11,15,12],[16,11,16,12],[17,11,17,12],[18,11,18,12],[19,11,19,12],[20,11,20,12],[21,11,21,12],[10,11,10,12],[3,0,3,1],[3,2,3,3],[3,5,3,6],[6,2,6,3],[6,6,6,10],[6,11,7,14],[8,11,8,12],[9,11,9,12],[3,13,3,14],[5,2,5,3],[5,6,5,10],[5,11,5,14],[3,7,3,8],[3,9,3,12],[0,0,0,5],[0,7,0,9],[0,10,0,11],[0,12,0,14],[1,0,1,3],[1,4,1,5],[1,10,1,11],[1,12,1,14]]}
["POST-VISIT REPORT FORM: PART 2a - Site Visit Record (Addendum)",null,null,null,null,null,null,"Voyage Number:",null,null,{"$f":"T('Post-visit Report - Part 1'!J8)","v":""}]
["Complete one line of the Site Visit Record wherever Expedition members disembark or journey beyond base or camp.              ",null,null,null,"View Instructions for this Page",null,null,"Embarkation Date:",null,null,{"$f":"IF('Post-visit Report - Part 1'!E14 = 0, \"\", 'Post-visit Report - Part 1'!E14)","v":""}]
[]
["Tour Company or Name:",null,{"$f":"CONCATENATE(T('Post-visit Report - Part 1'!D8), \" \", T('Post-visit Report - Part 1'!B9))","v":" "},null,"Vessel Name:",{"$f":"CONCATENATE(T('Post-visit Report - Part 1'!J10), \" \", T('Post-visit Report - Part 1'!H11))","v":" "},null,"Voyage Name:",null,{"$f":"T('Post-visit Report - Part 1'!J9)","v":""}]
[]
["Date","Site visited","Site Latitude/Longitude",null,"1st pax arrive","Last pax depart","Number of people",null,null,null,null,"Activities at Site"]
[null,null,null,null,"shore/site","shore/site","making site visit",null,null,null,null,"Select up to three activities per Site Visit entry. \nUse additional lines if the number of passengers differs per activity or more than three activities occurred."]
[null,null,"Latitude","Longitude","(in GMT)","(in GMT)","Pax","Staff","Crew","Other","Total",null,null,null,null,"Activity Example"]
[null,null,null,null,null,null,null,null,null,null,{"$f":"SUM(G9:J9)","v":0}]
[null,null,null,null,null,null,null,null,null,null,0]
[null,null,null,null,null,null,null,null,null,null,0]
[null,null,null,null,null,null,null,null,null,null,{"$f":"SUM(G12:J12)","v":0}]
[null,null,null,null,null,null,null,null,null,null,{"$f":"SUM(G13:J13)","v":0}]
[null,null,null,null,null,null,null,null,null,null,{"$f":"SUM(G14:J14)","v":0}]
[null,null,null,null,null,null,null,null,null,null,0,null,null,"  "]
{"$rows_left_out":28}
{"sheet":"Part 2b - Site visits cont.","index":5,"n_rows":42,"n_cols":16,"rows_kept":42,"cut":false,"hidden":false,"merged":[[0,0,0,5],[0,7,0,9],[0,10,0,11],[0,12,0,14],[1,0,1,3],[1,4,1,5],[1,10,1,11],[1,12,1,14],[10,11,10,12],[3,0,3,1],[3,2,3,3],[3,5,3,6],[6,2,6,3],[6,6,6,10],[6,11,7,14],[8,11,8,12],[9,11,9,12],[3,13,3,14],[5,2,5,3],[5,6,5,10],[5,11,5,14],[3,7,3,8],[3,9,3,12],[22,11,22,12],[11,11,11,12],[12,11,12,12],[13,11,13,12],[14,11,14,12],[15,11,15,12],[16,11,16,12],[17,11,17,12],[18,11,18,12],[19,11,19,12],[20,11,20,12],[21,11,21,12],[34,11,34,12],[23,11,23,12],[24,11,24,12],[25,11,25,12],[26,11,26,12],[27,11,27,12],[28,11,28,12],[29,11,29,12],[30,11,30,12],[31,11,31,12],[32,11,32,12],[33,11,33,12],[35,11,35,12],[36,11,36,12],[38,1,38,5],[38,12,38,14],[39,1,39,5],[39,12,41,14],[40,1,40,5],[41,1,41,5]]}
["POST-VISIT REPORT FORM: PART 2b - Site Visit Record (Addendum)",null,null,null,null,null,null,"Voyage Number:",null,null,{"$f":"T('Post-visit Report - Part 1'!J8)","v":""}]
["Complete one line of the Site Visit Record wherever Expedition members disembark or journey beyond base or camp.              ",null,null,null,"View Instructions for this Page",null,null,"Embarkation Date:",null,null,{"$f":"IF('Post-visit Report - Part 1'!E14 = 0, \"\", 'Post-visit Report - Part 1'!E14)","v":""}]
[]
["Tour Company or Name:",null,{"$f":"CONCATENATE(T('Post-visit Report - Part 1'!D8), \" \", T('Post-visit Report - Part 1'!B9))","v":" "},null,"Vessel Name:",{"$f":"CONCATENATE(T('Post-visit Report - Part 1'!J10), \" \", T('Post-visit Report - Part 1'!H11))","v":" "},null,"Voyage Name:",null,{"$f":"T('Post-visit Report - Part 1'!J9)","v":""}]
[]
["Date","Site visited","Site Latitude/Longitude",null,"1st pax arrive","Last pax depart","Number of people",null,null,null,null,"Activities at Site"]
[null,null,null,null,"shore/site","shore/site","making site visit",null,null,null,null,"Select up to three activities per Site Visit entry. \nUse additional lines if the number of passengers differs per activity or more than three activities occurred."]
[null,null,"Latitude","Longitude","(in GMT)","(in GMT)","Pax","Staff","Crew","Other","Total",null,null,null,null,"Activity Example"]
[null,null,null,null,null,null,null,null,null,null,{"$f":"SUM(G9:J9)","v":0}]
[null,null,null,null,null,null,null,null,null,null,0]
[null,null,null,null,null,null,null,null,null,null,0]
[null,null,null,null,null,null,null,null,null,null,{"$f":"SUM(G12:J12)","v":0}]
[null,null,null,null,null,null,null,null,null,null,{"$f":"SUM(G13:J13)","v":0}]
[null,null,null,null,null,null,null,null,null,null,{"$f":"SUM(G14:J14)","v":0}]
[null,null,null,null,null,null,null,null,null,null,0,null,null,"  "]
{"$rows_left_out":28}
{"sheet":"Part 3 - South Georgia","index":6,"n_rows":21,"n_cols":7,"rows_kept":21,"cut":false,"hidden":false,"merged":[[0,0,0,5],[0,6,0,7],[6,5,6,8],[6,0,6,4],[7,5,7,8],[7,0,7,4],[4,0,4,4],[4,7,4,8],[5,0,5,4],[5,5,5,6],[5,7,5,8],[20,0,20,4],[19,0,19,4],[11,0,11,8],[8,0,8,2],[8,3,8,4],[8,5,8,6],[8,7,8,8],[16,0,16,8],[17,0,17,8],[18,0,18,8],[12,0,12,8],[13,0,13,8],[14,0,14,8],[15,0,15,8]]}
["POST-VISIT REPORT FORM: PART 3 - South Georgia",null,null,null,null,null,"View Instructions for this Page"]
[]
[]
["A:","Expedition Details"]
["Company name:",null,null,null,null,"Permit number:","2019-20/"]
[{"$f":"T('Post-visit Report - Part 1'!B9)","v":""},null,null,null,null,"Permit holder (e.g. Expedition Leader):"]
["Last landfall before arrival at SGSSI:",null,null,null,null,"First landfall after departure from SGSSI:"]
[]
["Date at last landfall:",null,null,null,null,"Date at next landfall:"]
[]
["B:","Report on Expedition"]
["1. Any actions taken in case of emergency (Enter 'None' if none):"]
[]
["2. Any changes from the intended itinerary as details on Application Form (Enter 'None' if none):"]
[]
{"$rows_left_out":7}
{"sheet":"Site Reference Data","index":7,"n_rows":728,"n_cols":22,"rows_kept":728,"cut":false,"hidden":true,"merged":[[0,0,0,3],[0,5,0,8],[5,21,22,25],[0,10,0,13],[0,15,0,18]]}
["Antarctic Site Reference Data",null,null,null,null,"Falklands Site Reference Data",null,null,null,null,"South Georgia Site Reference Data",null,null,null,null,"Combined Sites Reference Data"]
["Sites","Latitude","Longitude","Location",null,"Sites","Latitude","Longitude","Location",null,"Sites","Latitude","Longitude","Location",null,"Sites","Latitude","Longitude","Location"]
["1/2019 - Hauron Peak landing","64°55'4\"S","62°55'31\"W","Peninsula",null,"Barren Island","52°22'32\"S","59°42'W","Falkland Islands",null,"Ample Bay","54°3'S","37°22'58\"E","South Georgia",null,"1/2019 - Hauron Peak landing","64°55'4\"S","62°55'31\"W","Peninsula"]
["2/2019","67°44'S","67°44'W","Peninsula",null,"Beaver Island","51°51'S","61°15'W","Falkland Islands",null,"Antarctic Bay","54°4'S","36°58'E","South Georgia",null,"2/2019","67°44'S","67°44'W","Peninsula"]
["Access Point","64°50'S","63°47'W","Peninsula",null,"Berkley Sound","51°34'4\"S","57°56'6\"E","Falkland Islands",null,"Beckmann Fjord","54°3'S","37°12'E","South Georgia",null,"Access Point","64°50'S","63°47'W","Peninsula"]
["Active Sound","63°25'S","56°10'W","Peninsula",null,"Bleaker Island - Adventure Sound","52°12'S","58°51'W","Falkland Islands",null,"Bird Island","54°0'18\"S","38°3'E","South Georgia",null,"Active Sound","63°25'S","56°10'W","Peninsula",null,null,"Instructions:\n\nTo update the Sites lists on the left, download the expedition sites list from the IAATO web application (Expedition Sites page, \"Export list to Excel\").\n\nIn the downloaded AntarcticSites Excel file, sort by column Location and copy columns A to D for the Falkland Islands rows into cell F3 of this sheet. \n\nSimilarly for the Antarctica entries: In the downloaded AntarcticSites Excel file, temporarily delete all of the rows except for Continent, Peninsula and Region. Then sort by first column 'Site Name' and copy and paste the resulting Antarctica only rows (columns A to D) into cell A3 of this sheet."]
["Adelaide Anchorage","67°47'S","68°57'W","Peninsula",null,"Bleaker Island - Sandy Bay Landing","52°11'S","58°50'W","Falkland Islands",null,"Bjelland Point","54°6'S","36°43'58\"E","South Georgia",null,"Adelaide Anchorage","67°47'S","68°57'W","Peninsula"]
["Adie Cove","65°28'58\"S","63°46'29\"W","Peninsula",null,"Bluff Cove","51°46'S","58°11'W","Falkland Islands",null,"Bjornstadt Bay","54°34'58\"S","35°55'1\"E","South Georgia",null,"Adie Cove","65°28'58\"S","63°46'29\"W","Peninsula"]
["Admiralty Bay","62°10'S","58°25'W","Peninsula",null,"Carcass Island","51°16'50\"S","60°33'45\"W","Falkland Islands",null,"Bristol Island","59°1'58\"S","21°30'57\"W","South Georgia",null,"Admiralty Bay","62°10'S","58°25'W","Peninsula"]
["Admiralty Sound","64°20'S","57°10'W","Peninsula",null,"Carcass Island - Leopard Beach","51°18'39\"S","60°31'19\"W","Falkland Islands",null,"Candlemas Island","57°3'S","26°40'W","South Georgia",null,"Admiralty Sound","64°20'S","57°10'W","Peninsula"]
["Aguirre Passage","64°29'23\"S","62°30'35\"W","Peninsula",null,"Darwin","51°48'10\"S","58°57'7\"W","Falkland Islands",null,"Cape Best","54°5'16\"S","36°48'57\"E","South Georgia",null,"Aguirre Passage","64°29'23\"S","62°30'35\"W","Peninsula"]
["Aitcho Islands - Barrientos Island","62°24'S","59°47'W","Peninsula",null,"Falkland Sound","51°48'S","59°30'W","Falkland Islands",null,"Cape Charlotte","54°31'58\"S","35°54'E","South Georgia",null,"Aitcho Islands - Barrientos Island","62°24'S","59°47'W","Peninsula"]
["Aitcho Islands - Other","62°24'S","59°47'W","Peninsula",null,"George Island","52°20'48\"S","59°44'58\"W","Falkland Islands",null,"Cape Demidov","54°8'S","37°44'E","South Georgia",null,"Aitcho Islands - Other","62°24'S","59°47'W","Peninsula"]
["Alcock Island","64°14'S","61°8'W","Peninsula",null,"Goose Green","51°49'26\"S","58°57'23\"W","Falkland Islands",null,"Cape North","53°58'S","37°43'58\"E","South Georgia",null,"Alcock Island","64°14'S","61°8'W","Peninsula"]
["Alexander Island","71°0'S","70°0'W","Peninsula",null,"Grand Jason","51°3'36\"S","61°6'W","Falkland Islands",null,"Cape Rosa - KIN01","54°11'S","37°25'W","South Georgia",null,"Alexander Island","71°0'S","70°0'W","Peninsula"]
{"$rows_left_out":714}
{"sheet":"myvariables","index":8,"n_rows":728,"n_cols":26,"rows_kept":728,"cut":false,"hidden":true,"merged":[]}
["Expedition Type",null,"Nationalities",null,null,"Antarctica",null,"Yes/No",null,null,"Activities",null,null,"Falkland Sites",null,null,"South Georgia",null,null,"Combined Sites",null,null,"Operators",null,null,"Vessels"]
[]
["Aircraft",null,"Afghanistan",null,null,"1/2019 - Hauron Peak landing",null,"Yes",null,null,"Aircraft Flight",null,null,"Barren Island",null,null,"Ample Bay",null,null,"1/2019 - Hauron Peak landing",null,null,"Abercrombie & Kent USA, LLC",null,null,"Aircraft Miscellaneous"]
["Land",null,"Albania",null,null,"2/2019",null,"No",null,null,"Aircraft Landing",null,null,"Beaver Island",null,null,"Antarctic Bay",null,null,"2/2019",null,null,"Albatros Travel / Albatros Expeditions",null,null,"ALE-IL76"]
["Motor Yacht",null,"Algeria",null,null,"Access Point",null,"Don't Know",null,null,"Anchoring",null,null,"Berkley Sound",null,null,"Beckmann Fjord",null,null,"Access Point",null,null,"Antarctica21",null,null,"ARK-TRUCK"]
["Motor Vehicle",null,"American Samoa",null,null,"Active Sound",null,null,null,null,"Citizen Science",null,null,"Bleaker Island - Adventure Sound",null,null,"Bird Island",null,null,"Active Sound",null,null,"Antarctic Logistics & Expeditions",null,null,"DAP-KING300"]
["Other",null,"Andorra",null,null,"Adelaide Anchorage",null,null,null,null,"Climbing",null,null,"Bleaker Island - Sandy Bay Landing",null,null,"Bjelland Point",null,null,"Adelaide Anchorage",null,null,"Antarpply Expeditions",null,null,"TAC-IL76"]
["Sailing Vessel",null,"Angola",null,null,"Adie Cove",null,null,null,null,"Deep Field Camping",null,null,"Bluff Cove",null,null,"Bjornstadt Bay",null,null,"Adie Cove",null,null,"Arctic Trucks",null,null,"WD - BT67"]
["Ship",null,"Anguilla",null,null,"Admiralty Bay",null,null,null,null,"Expedition support",null,null,"Carcass Island",null,null,"Bristol Island",null,null,"Admiralty Bay",null,null,"Aurora Expeditions",null,null,"WD - DHC"]
[null,null,"Antigua and Barbuda",null,null,"Admiralty Sound",null,null,null,null,"Extended Walk",null,null,"Carcass Island - Leopard Beach",null,null,"Candlemas Island",null,null,"Admiralty Sound",null,null,"Celebrity Cruise Lines/Royal Carribbean/Azamara Cruises",null,null,"WD - G450"]
[null,null,"Argentina",null,null,"Aguirre Passage",null,null,null,null,"Filming",null,null,"Darwin",null,null,"Cape Best",null,null,"Aguirre Passage",null,null,"Cheesemans' Ecology Safaris",null,null,"WD - G550"]
[null,null,"Armenia",null,null,"Aitcho Islands - Barrientos Island",null,null,null,null,"Gear Depoting",null,null,"Falkland Sound",null,null,"Cape Charlotte",null,null,"Aitcho Islands - Barrientos Island",null,null,"Crystal Cruises, LLC",null,null,"WD - IL76"]
[null,null,"Aruba",null,null,"Aitcho Islands - Other",null,null,null,null,"Helicopter Flight",null,null,"George Island",null,null,"Cape Demidov",null,null,"Aitcho Islands - Other",null,null,"DAP Antarctica",null,null,"Braveheart"]
[null,null,"Australia",null,null,"Alcock Island",null,null,null,null,"Helicopter Landing",null,null,"Goose Green",null,null,"Cape North",null,null,"Alcock Island",null,null,"EYOS Expeditions Ltd.",null,null,"Gayle Force"]
[null,null,"Austria",null,null,"Alexander Island",null,null,null,null,"Ice Landing",null,null,"Grand Jason",null,null,"Cape Rosa - KIN01",null,null,"Alexander Island",null,null,"Fathom Expeditions Inc.",null,null,"MY Archimedes"]
{"$rows_left_out":714}
{"sheet":"Variables","index":9,"n_rows":128,"n_cols":12,"rows_kept":128,"cut":false,"hidden":true,"merged":[]}
["Nationalities:",null,"Expedition Values:",null,"Sites","Latitude","Longitude","Location",null,null,"ID Code","ID Date"]
[null,null,"Ship",null," "," "," ",null,null,null,"PVR0203R002CBR170902-1002","2002-09-17"]
["United States",null,"Yacht",null,"Admirality Bay","62°10'S","058°48'W","C. Ferraz"]
["Albania",null,"Aircraft",null,"Aitcho Islands","62°24'S","059°47'W","English Strait. SSI"]
["Andorra",null,null,null,"Alcock Island","64°14'S","061°08'W","Hughes Bay"]
["Argentina",null,null,null,"Almirante","64°52'S","062°52'W","Almirante"]
["Australia",null,null,null,"Arago Glacier","64°51'S","062°23'W","Andvord Bay"]
["Austria",null,null,null,"Arctowski","62°15'S","058°51'W"]
["Bangladesh",null,null,null,"Ardley Island","62°13'S","058°56'W","SW KGI, SSI"]
["Belgium",null,null,null,"Argentine Islands","65°15'S","064°16'W","Penola Strait"]
["Bermuda",null,null,null,"Astrolabe Island","63°17'S","058°40'W","Bransfield Strait"]
["Bosnia/Herzego.",null,null,null,"Baily Head","62°58'S","060°30'W","Deception Island, SSI"]
["Brazil",null,null,null,"Barcroft Islands","66°27'S","067°10'W","Biscoe Islands"]
["Bulgaria",null,null,null,"Bennett Islands","66°56'S","067°40'W","Hanusse Bay"]
["Canada",null,null,null,"Berthelot Islands","65°20'S","064°09'W","Grandidier Channel"]
{"$rows_left_out":113}